100 90 32
3f2,0
1
64,0
2,1
64,0
2,1
63,0
2,1
64,0
2,1
64,0
2,1
63,0
2,1
64,0
2,1
63,0
2,1
64,0
2,1
64,0
2,1
63,0
2,1
64,0
2,1
1a71,0
100 90 32
2328,0
100 90 32
2328,0
100 90 32
2328,0
100 90 32
2328,0
100 90 32
2328,0
100 90 32
2328,0
100 90 32
2328,0
100 90 32
2328,0
100 90 32
2328,0
100 90 32
2328,0
100 90 32
2328,0
100 90 32
2328,0
100 90 32
2328,0
100 90 32
2328,0
100 90 32
2328,0
100 90 32
2328,0
