100 90 8
324,0
46,1
1e,0
46,1
1e,0
46,1
1e,0
e,1
2,0
10,1
3,0
8,1
4,0
17,1
1e,0
1
4,0
9,1
2,0
7,1
5,0
5,1
9,0
3,1
2,0
1
3,0
3,1
3,0
8,1
4,0
1
1e,0
2,1
3,0
9,1
2,0
6,1
2,0
2,1
2,0
5,1
2,0
1
2,0
2,1
2,0
3,1
2,0
2,1
2,0
3,1
2,0
8,1
2,0
2,1
20,0
2,1
3,0
9,1
6,0
1
2,0
3,1
2,0
1
6,0
1
6,0
3,1
2,0
2,1
3,0
1
9,0
1
2,0
4,1
1f,0
1
2,0
1
2,0
8,1
2,0
3,1
4,0
5,1
2,0
3,1
2,0
1
4,0
5,1
2,0
2,1
3,0
1
3,0
1
2,0
2,1
4,0
4,1
1f,0
1
2,0
1
2,0
8,1
2,0
3,1
4,0
5,1
2,0
3,1
2,0
1
4,0
5,1
2,0
2,1
7,0
1
2,0
2,1
4,0
4,1
1f,0
1
5,0
8,1
2,0
3,1
4,0
5,1
2,0
3,1
2,0
1
2,0
2,1
2,0
3,1
2,0
2,1
2,0
1
0
1
2,0
1
2,0
2,1
4,0
4,1
1f,0
1
0
3,1
2,0
7,1
2,0
3,1
2,0
1
2,0
3,1
3,0
3,1
2,0
1
2,0
2,1
2,0
3,1
2,0
2,1
2,0
3,1
2,0
1
2,0
2,1
2,0
1
2,0
2,1
23,0
1
4,0
6,1
6,0
3,1
4,0
2,1
d,0
1
9,0
1
b,0
1
4,0
1
1e,0
46,1
1e,0
46,1
1e,0
46,1
1a46,0
100 90 8
1f8,0
60,1
4,0
60,1
4,0
60,1
4,0
60,1
4,0
14,1
3,0
17,1
3,0
d,1
4,0
1e,1
4,0
2,1
5,0
d,1
3,0
b,1
6,0
6,1
3,0
1
9,0
3,1
4,0
4,1
3,0
5,1
3,0
c,1
7,0
2,1
5,0
e,1
2,0
9,1
8,0
7,1
2,0
1
9,0
5,1
2,0
4,1
4,0
3,1
4,0
a,1
9,0
3,1
4,0
e,1
2,0
1
4,0
3,1
3,0
4,1
2,0
2,1
4,0
1
2,0
2,1
2,0
4,1
2,0
5,1
2,0
5,1
3,0
3,1
3,0
1
3,0
1
3,0
3,1
2,0
3,1
4,0
3,1
5,0
d,1
8,0
2,1
2,0
5,1
2,0
1
8,0
2,1
2,0
1
2,0
1
2,0
5,1
2,0
5,1
4,0
1
4,0
1
8,0
1
2,0
4,1
4,0
2,1
3,0
1
2,0
d,1
3,0
3,1
3,0
1
2,0
7,1
3,0
3,1
3,0
2,1
5,0
8,1
2,0
5,1
4,0
1
4,0
2,1
3,0
2,1
2,0
1
2,0
4,1
4,0
2,1
7,0
c,1
2,0
5,1
2,0
1
2,0
7,1
2,0
5,1
2,0
2,1
5,0
8,1
2,0
5,1
2,0
1
3,0
1
2,0
2,1
2,0
3,1
2,0
1
2,0
4,1
4,0
2,1
7,0
c,1
2,0
5,1
2,0
1
2,0
7,1
2,0
5,1
2,0
2,1
2,0
1
2,0
1
2,0
5,1
2,0
5,1
2,0
1
3,0
1
2,0
2,1
2,0
3,1
2,0
1
2,0
4,1
4,0
1
2,0
5,1
2,0
b,1
3,0
3,1
3,0
1
3,0
4,1
5,0
3,1
3,0
2,1
2,0
4,1
2,0
5,1
2,0
5,1
2,0
2,1
2,0
1
2,0
2,1
2,0
3,1
2,0
2,1
2,0
3,1
8,0
2,1
5,0
9,1
9,0
3,1
8,0
1
12,0
2,1
8,0
1
4,0
3,1
8,0
1
4,0
1
d,0
2,1
5,0
9,1
3,0
1
4,0
6,1
4,0
4,1
4,0
1
c,0
2,1
8,0
1
4,0
3,1
8,0
1
4,0
3,1
7,0
60,1
4,0
60,1
4,0
60,1
4,0
60,1
19c8,0
