{
  "uniqueId": "androidx.databinding:databinding-adapters",
  "name": "Support DataBinding Adapters",
  "developers": [
    {
      "name": "The Android Open Source Project"
    }
  ],
  "description": "Bind UI components in your layouts to data sources in your app using a declarative format.",
  "website": "https://developer.android.com/topic/libraries/data-binding"
}
