Add 20-ot-weight-to-fc.conf

Ruleset to liner-interpolate weight value in OT scale to FC scale.

Fixes fontconfig/fontconfig#215
3 jobs for issue/215 in 10 minutes and 28 seconds (queued for 1 second)
latest
Status Job ID Name Coverage
  Build
failed #1622095
mingw-build

00:10:28

failed #1622093
shared-build

00:09:13

failed #1622094
static-build

00:03:22

 
Name Stage Failure
failed
shared-build Build
WARNING: build-*/fontconfig*/_build/sub/test/*.trs: no matching files 
WARNING: build-*/fontconfig*/_build/sub/test/out*: no matching files
build-*/*.log: found 1 matching files

build-*/test/*.log: found 11 matching files

build-*/test/*.trs: found 10 matching files

build-*/test/out*: found 1 matching files

prefix-*: found 19 matching files

Uploading artifacts to coordinator... ok
id=1622093 responseStatus=201 Created token=ec5ba4Sm
ERROR: Job failed: exit code 1
failed
static-build Build
make[1]: Leaving directory '/builds/tagoh/fontconfig/build-fontconfig-b014941ed423a7bf2462ff4b722c320456719cf9-1622094/test'
make: *** [Makefile:599: check-recursive] Error 1
Uploading artifacts...
build-*/*.log: found 1 matching files
build-*/test/*.log: found 13 matching files

build-*/test/*.trs: found 12 matching files

build-*/test/out*: found 1 matching files

Uploading artifacts to coordinator... ok
id=1622094 responseStatus=201 Created token=yqmUsbAW
ERROR: Job failed: exit code 1
failed
mingw-build Build
make[1]: *** [Makefile:1324: check] Error 2
make: *** [Makefile:599: check-recursive] Error 1
Uploading artifacts...
build-*/*.log: found 1 matching files
build-*/test/*.log: found 9 matching files

build-*/test/*.trs: found 8 matching files

build-*/test/out*: found 3 matching files

Uploading artifacts to coordinator... ok
id=1622095 responseStatus=201 Created token=DnTTPqrd
ERROR: Job failed: exit code 1