Add _dbus_track_enable_dump_on_exit ()

11 jobs for simplify-windows-spawn in 60 minutes and 4 seconds (queued for 2 seconds)
latest
Name Stage Failure
failed
build:x86_64-w64-mingw32 Build
libtool: compile:  x86_64-w64-mingw32-gcc -DHAVE_CONFIG_H -I. -I../../dbus -I.. -I.. -I../.. -DDBUS_COMPILATION -DDBUS_MACHINE_UUID_FILE=\"/usr/local/var/lib/dbus/machine-id\" -DDBUS_SYSTEM_CONFIG_FILE=\"/usr/local/share/dbus-1/system.conf\" -DDBUS_SESSION_CONFIG_FILE=\"/usr/local/share/dbus-1/session.conf\" -DDBUS_RUNSTATEDIR=\"/usr/local/var/run\" -fno-strict-aliasing -fno-common -Wall -Wextra -Wundef -Wwrite-strings -Wpointer-arith -Wmissing-declarations -Wredundant-decls -Wno-unused-parameter -Wno-missing-field-initializers -Wformat=2 -Wcast-align -Wformat-nonliteral -Wformat-security -Wsign-compare -Wstrict-aliasing -Wshadow -Winline -Wpacked -Wmissing-format-attribute -Wmissing-noreturn -Winit-self -Wmissing-include-dirs -Wunused-but-set-variable -Warray-bounds -Wreturn-type -Wswitch-enum -Wswitch-default -Wduplicated-cond -Wduplicated-branches -Wlogical-op -Wrestrict -Wnull-dereference -Wdouble-promotion -Wchar-subscripts -Wfloat-equal -Wpointer-sign -Wno-unused-label -Wnested-externs -Wmissing-prototypes -Wstrict-prototypes -Wdeclaration-after-statement -Wimplicit-function-declaration -Wold-style-definition -Wjump-misses-init -Wno-error=unused-parameter -Wno-error=missing-field-initializers -Wno-error=unused-label -static-libgcc -MT dbus-asv-util.lo -MD -MP -MF .deps/dbus-asv-util.Tpo -c ../../dbus/dbus-asv-util.c  -DDLL_EXPORT -DPIC -o .libs/dbus-asv-util.o
libtool: compile: x86_64-w64-mingw32-gcc -DHAVE_CONFIG_H -I. -I../../dbus -I.. -I.. -I../.. -DDBUS_COMPILATION -DDBUS_MACHINE_UUID_FILE=\"/usr/local/var/lib/dbus/machine-id\" -DDBUS_SYSTEM_CONFIG_FILE=\"/usr/local/share/dbus-1/system.conf\" -DDBUS_SESSION_CONFIG_FILE=\"/usr/local/share/dbus-1/session.conf\" -DDBUS_RUNSTATEDIR=\"/usr/local/var/run\" -fno-strict-aliasing -fno-common -Wall -Wextra -Wundef -Wwrite-strings -Wpointer-arith -Wmissing-declarations -Wredundant-decls -Wno-unused-parameter -Wno-missing-field-initializers -Wformat=2 -Wcast-align -Wformat-nonliteral -Wformat-security -Wsign-compare -Wstrict-aliasing -Wshadow -Winline -Wpacked -Wmissing-format-attribute -Wmissing-noreturn -Winit-self -Wmissing-include-dirs -Wunused-but-set-variable -Warray-bounds -Wreturn-type -Wswitch-enum -Wswitch-default -Wduplicated-cond -Wduplicated-branches -Wlogical-op -Wrestrict -Wnull-dereference -Wdouble-promotion -Wchar-subscripts -Wfloat-equal -Wpointer-sign -Wno-unused-label -Wnested-externs -Wmissing-prototypes -Wstrict-prototypes -Wdeclaration-after-statement -Wimplicit-function-declaration -Wold-style-definition -Wjump-misses-init -Wno-error=unused-parameter -Wno-error=missing-field-initializers -Wno-error=unused-label -static-libgcc -MT dbus-asv-util.lo -MD -MP -MF .deps/dbus-asv-util.Tpo -c ../../dbus/dbus-asv-util.c -o dbus-asv-util.o >/dev/null 2>&1
make[3]: Leaving directory '/builds/rhabacker/dbus/ci-build-production-x86_64-w64-mingw32/dbus'
make[2]: Leaving directory '/builds/rhabacker/dbus/ci-build-production-x86_64-w64-mingw32/dbus'
make[2]: *** [Makefile:940: all] Error 2
make[1]: Leaving directory '/builds/rhabacker/dbus/ci-build-production-x86_64-w64-mingw32'
make[1]: *** [Makefile:698: all-recursive] Error 1
make: *** [Makefile:565: all] Error 2
Cleaning up file based variables
ERROR: Job failed: exit code 1
failed
build:i686-w64-mingw32-debug Build
libtool: compile:  i686-w64-mingw32-gcc -DHAVE_CONFIG_H -I. -I../../dbus -I.. -I.. -I../.. -DDBUS_COMPILATION -DDBUS_MACHINE_UUID_FILE=\"/usr/local/var/lib/dbus/machine-id\" -DDBUS_SYSTEM_CONFIG_FILE=\"/usr/local/share/dbus-1/system.conf\" -DDBUS_SESSION_CONFIG_FILE=\"/usr/local/share/dbus-1/session.conf\" -DDBUS_RUNSTATEDIR=\"/usr/local/var/run\" -fno-strict-aliasing -fno-common -Wall -Wextra -Wundef -Wwrite-strings -Wpointer-arith -Wmissing-declarations -Wredundant-decls -Wno-unused-parameter -Wno-missing-field-initializers -Wformat=2 -Wcast-align -Wformat-nonliteral -Wformat-security -Wsign-compare -Wstrict-aliasing -Wshadow -Winline -Wpacked -Wmissing-format-attribute -Wmissing-noreturn -Winit-self -Wmissing-include-dirs -Wunused-but-set-variable -Warray-bounds -Wreturn-type -Wswitch-enum -Wswitch-default -Wduplicated-cond -Wduplicated-branches -Wlogical-op -Wrestrict -Wnull-dereference -Wdouble-promotion -Wchar-subscripts -Wfloat-equal -Wpointer-sign -Wnested-externs -Wmissing-prototypes -Wstrict-prototypes -Wdeclaration-after-statement -Wimplicit-function-declaration -Wold-style-definition -Wjump-misses-init -Werror -Wno-suggest-attribute=format -Wno-error=unused-parameter -Wno-error=missing-field-initializers -static-libgcc -g -O0 -MT dbus-asv-util.lo -MD -MP -MF .deps/dbus-asv-util.Tpo -c ../../dbus/dbus-asv-util.c -o dbus-asv-util.o >/dev/null 2>&1
make[3]: Leaving directory '/builds/rhabacker/dbus/ci-build-debug-i686-w64-mingw32/dbus'
make[2]: *** [Makefile:940: all] Error 2
make[2]: Leaving directory '/builds/rhabacker/dbus/ci-build-debug-i686-w64-mingw32/dbus'
make[1]: *** [Makefile:698: all-recursive] Error 1
make[1]: Leaving directory '/builds/rhabacker/dbus/ci-build-debug-i686-w64-mingw32'
make: *** [Makefile:565: all] Error 2
Cleaning up file based variables
ERROR: Job failed: exit code 1
failed
build:x86_64-w64-mingw32-cmake-debug Build The script exceeded the maximum execution time set for the job
30: 128 allocations found
30: [0T:861] malloc(24) 0000000000555510 ""
30: [(null):0] PT(5612176) 0000000000558460 "p�U"
30: # Testing stuck in poll
30: ok 1 - 0s
30: Bail out! Reply is error: org.freedesktop.DBus.Error.NoReply ***
30: 573 allocations found
30: [(null):0] (null)(0) 0000000000000000 "(null)"
ERROR: Job failed: execution took longer than 1h0m0s seconds