{
    "uniqueId": "org.khronos.openxr.runtime_broker:utils",
    "funding": [],
    "developers": [
        {
            "organisationUrl": "https://www.khronos.org",
            "name": "The Khronos Group Inc"
        },
        {
            "organisationUrl": "https://www.collabora.com",
            "name": "Collabora, Ltd."
        }
    ],
    "scm": {
        "url": "https://gitlab.freedesktop.org/monado/utilities/openxr-android-broker/-/tree/main/utils?ref_type=heads"
    },
    "name": "OpenXR Runtime Broker Utils",
    "description": "Utilities for using or providing an OpenXR Runtime Broker content provider",
    "website": "https://gitlab.freedesktop.org/monado/utilities/openxr-android-broker/",
    "licenses": [
        "BSL-1.0"
    ]
}
