{
    "#1": "This config is intended for generating wrappers around the classes included in Monado.",
    "#2": "Use those wrappers in conjunction with the Java and Android Platform wrappers made with the",
    "#3": "default config.",
    "$schema": "./wrapped.schema.json",
    "$globalOptions": {
        "headerExtension": "hpp",
        "knownIncludes": [
            "wrap/android.app.h",
            "wrap/android.content.h",
            "wrap/android.content.pm.h",
            "wrap/android.database.h",
            "wrap/android.graphics.h",
            "wrap/android.net.h",
            "wrap/android.os.h",
            "wrap/android.provider.h",
            "wrap/android.service.vr.h",
            "wrap/android.util.h",
            "wrap/android.view.h",
            "wrap/android.widget.h",
            "wrap/dalvik.system.h",
            "wrap/java.lang.h",
            "wrap/java.util.h",
            "wrap/ObjectWrapperBase.h"
        ]
    },
    "org.freedesktop.monado.auxiliary": {
        "$packageOptions": {
            "directory": "wrap/xrt/auxiliary/android",
            "headerDocLines": [
                "/*!",
                " * @file",
                " * @brief  Partially-generated wrapper for the",
                " * `org.freedesktop.monado.auxiliary` Java package.",
                " * @author Rylie Pavlik <rylie.pavlik@collabora.com>",
                " * @ingroup aux_android",
                " */"
            ],
            "implHeaderDocLines": [
                "/*!",
                " * @file",
                " * @brief  Inline implementations for partially-generated wrapper for the",
                " * `org.freedesktop.monado.auxiliary` Java package - do not include on its own!",
                " * @author Rylie Pavlik <rylie.pavlik@collabora.com>",
                " * @ingroup aux_android",
                " */"
            ],
            "implDocLines": [
                "/*!",
                " * @file",
                " * @brief  Out-of-line implementations for partially-generated wrapper for the",
                " * `org.freedesktop.monado.auxiliary` Java package.",
                " * @author Rylie Pavlik <rylie.pavlik@collabora.com>",
                " * @ingroup aux_android",
                " */"
            ]
        },
        "MonadoView": {
            "classOptions": {
                "droppable": false,
                "staticInit": true,
                "provideQualifiedName": true,
                "sortMembers": true
            },
            "members": {
                "attachToActivity": {},
                "markAsDiscardedByNative": {},
                "waitGetSurfaceHolder": {
                    "parameters": [{"paramName": "wait_ms"}]
                },
                "getNativePointer": {},
                "getDisplayMetrics": {}
            }
        }
    },
    "org.freedesktop.monado.ipc": {
        "$packageOptions": {
            "directory": "wrap/xrt/ipc/android",
            "headerDocLines": [
                "/*!",
                " * @file",
                " * @brief  Partially-generated wrapper for the",
                " * `org.freedesktop.monado.ipc` Java package.",
                " * @author Rylie Pavlik <rylie.pavlik@collabora.com>",
                " * @ingroup ipc_android",
                " */"
            ],
            "implHeaderDocLines": [
                "/*!",
                " * @file",
                " * @brief  Inline implementations for partially-generated wrapper for the",
                " * `org.freedesktop.monado.ipc` Java package - do not include on its own!",
                " * @author Rylie Pavlik <rylie.pavlik@collabora.com>",
                " * @ingroup ipc_android",
                " */"
            ],
            "implDocLines": [
                "/*!",
                " * @file",
                " * @brief  Out-of-line implementations for partially-generated wrapper for the",
                " * `org.freedesktop.monado.ipc` Java package.",
                " * @author Rylie Pavlik <rylie.pavlik@collabora.com>",
                " * @ingroup ipc_android",
                " */"
            ]
        },
        "Client": {
            "classOptions": {
                "droppable": false,
                "staticInit": true,
                "provideQualifiedName": true,
                "sortMembers": true
            },
            "members": {
                "<init>": {
                    "parameters": [
                        {
                            "paramName": "nativePointer"
                        }
                    ]
                },
                "blockingConnect": {
                    "parameters": [
                        {},
                        {
                            "paramName": "packageName"
                        }
                    ]
                },
                "failed": {},
                "monado": {},
                "markAsDiscardedByNative": {}
            }
        },
        "IMonado": {
            "classOptions": {
                "droppable": false
            },
            "members": {
                "passAppSurface": {}
            }
        },
        "MonadoImpl": [
            {
                "droppable": false,
                "base": "org.freedesktop.monado.ipc.IMonado"
            },
            "context"
        ]
    },
    "##": "Don't actually generate the packages below from this config...",
    "android.app": {
        "Activity": [
            {
                "base": "android.content.Context"
            },
            "setVrModeEnabled",
            "getSystemService"
        ]
    },
    "android.content": {
        "Context": [
            "getClassLoader",
            "getApplicationContext",
            "createPackageContext",
            "getPackageManager",
            "startActivity",
            "getContentResolver",
            "WINDOW_SERVICE",
            "DISPLAY_SERVICE"
        ]
    },
    "android.view": {
        "Display": [
            "getRealSize",
            "getRealMetrics"
        ],
        "Surface": [
            "isValid"
        ],
        "SurfaceHolder": [
            "getSurface"
        ]
    },
    "android.graphics": {
        "Point": [
            "x",
            "y"
        ]
    }
}
