WIP: misc fixes to overlays and monado-ctl before rebasing on master

20 jobs for pb_multi_apps in 1 minute and 57 seconds (queued for 3 seconds)
latest
Status Job ID Name Coverage
  Container Prep
passed #2952130
arch:container_prep

00:00:20

passed #2952129
debian:container_prep

00:00:21

passed #2952132
ndk:container_prep

00:00:21

passed #2952131
ubuntu:container_prep

00:00:23

 
  Build
failed #2952139
arch:cmake

00:00:49

failed #2952140
arch:cmake:clang

00:00:58

passed #2952144
arch:meson

00:01:28

failed #2952134
debian:cmake

00:00:59

failed #2952146
debian:cmake:32bit

00:00:48

failed #2952135
debian:cmake-no-opencv

00:00:44

failed #2952136
debian:cmake-no-opengl

00:00:55

failed #2952137
debian:cmake-no-sdl2

00:00:57

passed #2952138
debian:cmake-no-service

00:01:00

passed #2952142
debian:meson

00:01:31

failed #2952145
debian:meson:32bit

00:00:49

failed #2952133
format-and-spellcheck

00:00:26

failed #2952148
ndk:arm64-v8a

00:00:46

failed #2952147
ndk:armeabi-v7a

00:00:32

failed #2952141
ubuntu:cmake

00:00:22

failed #2952143
ubuntu:meson

00:00:29

 
Name Stage Failure
failed
arch:cmake:clang Build
todo:122: warning: unexpected token TK_COMMAND_BS as the argument of _internalref
todo:138: warning: unexpected token TK_COMMAND_BS as the argument of _internalref
todo:155: warning: unexpected token TK_COMMAND_BS as the argument of _internalref
todo:161: warning: unexpected token TK_COMMAND_BS as the argument of _internalref
todo:180: warning: unexpected token TK_COMMAND_BS as the argument of _internalref
[196/208] Building CXX object src/xrt/auxiliary/CMakeFiles/aux_tracking.dir/tracking/t_imu.cpp.o
[197/208] Building CXX object src/xrt/auxiliary/CMakeFiles/aux_tracking.dir/tracking/t_kalman.cpp.o
ninja: build stopped: subcommand failed.
ERROR: Job failed: exit code 1
failed
debian:cmake Build
[193/205] Generating API documentation with Doxygen
warning: Included by graph for 'u_debug.h' not generated, too many nodes. Consider increasing DOT_GRAPH_MAX_NODES.
warning: Included by graph for 'u_misc.h' not generated, too many nodes. Consider increasing DOT_GRAPH_MAX_NODES.
/builds/monado/monado/doc/CHANGELOG.md:141: warning: explicit link request to 'pragma' could not be resolved
/builds/monado/monado/doc/CHANGELOG.md:210: warning: explicit link request to 'naming' could not be resolved
[194/205] Building CXX object src/xrt/auxiliary/CMakeFiles/aux_tracking.dir/tracking/t_imu.cpp.o
[195/205] Building CXX object src/xrt/auxiliary/CMakeFiles/aux_tracking.dir/tracking/t_kalman.cpp.o
ninja: build stopped: subcommand failed.
ERROR: Job failed: exit code 1
failed
debian:cmake-no-sdl2 Build
[183/197] Building C object src/xrt/compositor/CMakeFiles/comp_main.dir/main/comp_window_direct_randr.c.o
[184/197] Building C object src/xrt/compositor/CMakeFiles/comp_main.dir/main/comp_distortion.c.o
[185/197] Generating API documentation with Doxygen
warning: Included by graph for 'u_debug.h' not generated, too many nodes. Consider increasing DOT_GRAPH_MAX_NODES.
warning: Included by graph for 'u_misc.h' not generated, too many nodes. Consider increasing DOT_GRAPH_MAX_NODES.
[186/197] Building CXX object src/xrt/auxiliary/CMakeFiles/aux_tracking.dir/tracking/t_imu.cpp.o
[187/197] Building CXX object src/xrt/auxiliary/CMakeFiles/aux_tracking.dir/tracking/t_kalman.cpp.o
ninja: build stopped: subcommand failed.
ERROR: Job failed: exit code 1
failed
debian:cmake-no-opengl Build
[156/171] Building C object src/xrt/compositor/CMakeFiles/comp_main.dir/main/comp_window_direct.c.o
[157/171] Building C object src/xrt/compositor/CMakeFiles/comp_main.dir/main/comp_window_direct_randr.c.o
[158/171] Generating API documentation with Doxygen
warning: Included by graph for 'u_debug.h' not generated, too many nodes. Consider increasing DOT_GRAPH_MAX_NODES.
warning: Included by graph for 'u_misc.h' not generated, too many nodes. Consider increasing DOT_GRAPH_MAX_NODES.
[159/171] Building CXX object src/xrt/auxiliary/CMakeFiles/aux_tracking.dir/tracking/t_imu.cpp.o
[160/171] Building CXX object src/xrt/auxiliary/CMakeFiles/aux_tracking.dir/tracking/t_kalman.cpp.o
ninja: build stopped: subcommand failed.
ERROR: Job failed: exit code 1
failed
ndk:arm64-v8a Build
In file included from ../src/xrt/auxiliary/tracking/t_imu.cpp:11:
In file included from ../src/xrt/auxiliary/tracking/t_imu.h:10:
In file included from ../src/xrt/auxiliary/math/m_api.h:17:
../src/xrt/include/xrt/xrt_defines.h:13:10: fatal error: 'openxr/openxr.h' file not found
#include "openxr/openxr.h"
^~~~~~~~~~~~~~~~~
1 error generated.
ninja: build stopped: subcommand failed.
ERROR: Job failed: exit code 1
failed
debian:meson:32bit Build
../src/xrt/compositor/shaders/distortion.vert
[46/169] Generating mesh.vert.h with a custom command.
../src/xrt/compositor/shaders/mesh.vert
[47/169] Compiling C++ object 'src/xrt/auxiliary/f5ab5bb@@aux_util@sta/util_u_time.cpp.o'.
[48/169] Compiling C object 'src/xrt/auxiliary/f5ab5bb@@aux_ogl@sta/ogl_ogl_api.c.o'.
[49/169] Compiling C++ object 'src/xrt/auxiliary/f5ab5bb@@aux_util@sta/util_u_hashmap.cpp.o'.
[50/169] Compiling C++ object 'src/xrt/auxiliary/f5ab5bb@@aux_util@sta/util_u_hashset.cpp.o'.
ninja: build stopped: subcommand failed.
ERROR: Job failed: exit code 1
failed
debian:cmake:32bit Build
          ^~~~~~~~~~~~~~~~~
compilation terminated.
[46/130] Building C object src/xrt/state_trackers/oxr/CMakeFiles/st_oxr.dir/oxr_path.c.o
[47/130] Building CXX object src/xrt/auxiliary/CMakeFiles/aux_util.dir/util/u_time.cpp.o
[48/130] Building C object src/xrt/auxiliary/CMakeFiles/aux_ogl.dir/ogl/ogl_api.c.o
[49/130] Building CXX object src/xrt/auxiliary/CMakeFiles/aux_util.dir/util/u_hashmap.cpp.o
[50/130] Building CXX object src/xrt/auxiliary/CMakeFiles/aux_util.dir/util/u_hashset.cpp.o
ninja: build stopped: subcommand failed.
ERROR: Job failed: exit code 1
failed
arch:cmake Build
todo:122: warning: unexpected token TK_COMMAND_BS as the argument of _internalref
todo:138: warning: unexpected token TK_COMMAND_BS as the argument of _internalref
todo:155: warning: unexpected token TK_COMMAND_BS as the argument of _internalref
todo:161: warning: unexpected token TK_COMMAND_BS as the argument of _internalref
todo:180: warning: unexpected token TK_COMMAND_BS as the argument of _internalref
[196/208] Building CXX object src/xrt/auxiliary/CMakeFiles/aux_tracking.dir/tracking/t_imu.cpp.o
[197/208] Building CXX object src/xrt/auxiliary/CMakeFiles/aux_tracking.dir/tracking/t_kalman.cpp.o
ninja: build stopped: subcommand failed.
ERROR: Job failed: exit code 1
failed
debian:cmake-no-opencv Build
[180/195] Building C object src/xrt/compositor/CMakeFiles/comp_main.dir/main/comp_window_direct_randr.c.o
[181/195] Building C object src/xrt/compositor/CMakeFiles/comp_main.dir/main/comp_window_direct.c.o
[182/195] Building C object src/xrt/compositor/CMakeFiles/comp_main.dir/main/comp_window_xcb.c.o
[183/195] Generating API documentation with Doxygen
warning: Included by graph for 'u_debug.h' not generated, too many nodes. Consider increasing DOT_GRAPH_MAX_NODES.
warning: Included by graph for 'u_misc.h' not generated, too many nodes. Consider increasing DOT_GRAPH_MAX_NODES.
[184/195] Building CXX object src/xrt/auxiliary/CMakeFiles/aux_tracking.dir/tracking/t_imu.cpp.o
ninja: build stopped: subcommand failed.
ERROR: Job failed: exit code 1
failed
ndk:armeabi-v7a Build
In file included from ../src/xrt/auxiliary/tracking/t_imu.cpp:11:
In file included from ../src/xrt/auxiliary/tracking/t_imu.h:10:
In file included from ../src/xrt/auxiliary/math/m_api.h:17:
../src/xrt/include/xrt/xrt_defines.h:13:10: fatal error: 'openxr/openxr.h' file not found
#include "openxr/openxr.h"
^~~~~~~~~~~~~~~~~
1 error generated.
ninja: build stopped: subcommand failed.
ERROR: Job failed: exit code 1
failed
ubuntu:meson Build
                 from ../src/xrt/auxiliary/tracking/t_kalman.cpp:12:
../src/xrt/include/xrt/xrt_defines.h:13:10: fatal error: openxr/openxr.h: No such file or directory
13 | #include "openxr/openxr.h"
| ^~~~~~~~~~~~~~~~~
compilation terminated.
[55/192] Compiling C++ object 'src/xrt/auxiliary/f5ab5bb@@aux_util@sta/util_u_hashset.cpp.o'.
[56/192] Compiling C++ object 'src/xrt/auxiliary/f5ab5bb@@aux_util@sta/util_u_hashmap.cpp.o'.
ninja: build stopped: subcommand failed.
ERROR: Job failed: exit code 1
failed
format-and-spellcheck Build
+#define OXR_EXTENSION_SUPPORT_EXTX_overlay(_) _(EXTX_overlay, EXTX_OVERLAY)
#else
#define OXR_EXTENSION_SUPPORT_EXTX_overlay(_)
#endif
---------------------------------------
Uploading artifacts...
patches/: found 2 matching files
Uploading artifacts to coordinator... ok
id=2952133 responseStatus=201 Created token=z7jGNKzy
ERROR: Job failed: exit code 1
failed
ubuntu:cmake Build
../src/xrt/include/xrt/xrt_defines.h:13:10: fatal error: openxr/openxr.h: No such file or directory
13 | #include "openxr/openxr.h"
| ^~~~~~~~~~~~~~~~~
compilation terminated.
[52/205] Building C object src/xrt/auxiliary/CMakeFiles/aux_ogl.dir/ogl/ogl_api.c.o
[53/205] Building CXX object src/xrt/auxiliary/CMakeFiles/aux_util.dir/util/u_hashmap.cpp.o
[54/205] Building CXX object src/xrt/auxiliary/CMakeFiles/aux_util.dir/util/u_hashset.cpp.o
ninja: build stopped: subcommand failed.
ERROR: Job failed: exit code 1