RHEL 7.7 translations - fr,ja,zh-CN

10 jobs for ljanda/rhel-7.7 in 21 minutes and 46 seconds (queued for 1 second)
Status Job ID Name Coverage
  Test
failed #315839
allowed to fail
checkpatch

00:01:38

failed #315846
t_debian:9

00:06:14

failed #315848
t_debian:sid

00:04:16

manual #315847
allowed to fail manual
t_debian:testing
failed #315840
t_fedora:28

00:05:41

failed #315841
t_fedora:29

00:07:39

failed #315842
t_fedora:30

00:06:39

manual #315843
allowed to fail manual
t_fedora:rawhide
failed #315844
t_ubuntu:16.04

00:06:53

failed #315845
t_ubuntu:18.04

00:05:04

 
Name Stage Failure
failed
t_debian:sid Test
../../po/fr.po:2255: 'msgid' and 'msgstr' entries do not both end with '\n'
/usr/bin/msgfmt: found 1 fatal error
make[2]: *** [Makefile:289: fr.gmo] Error 1
make[2]: *** Waiting for unfinished jobs....
make[2]: Leaving directory '/builds/ljanda/NetworkManager/build/po'
make[1]: *** [Makefile:18587: all-recursive] Error 1
make[1]: Leaving directory '/builds/ljanda/NetworkManager/build'
make: *** [Makefile:8362: all] Error 2
ERROR: Job failed: exit code 1
failed
t_debian:9 Test
make[2]: *** Waiting for unfinished jobs....
Makefile:289: recipe for target 'fr.gmo' failed
make[2]: Leaving directory '/builds/ljanda/NetworkManager/build/po'
Makefile:17954: recipe for target 'all-recursive' failed
make[1]: *** [all-recursive] Error 1
make[1]: Leaving directory '/builds/ljanda/NetworkManager/build'
Makefile:7694: recipe for target 'all' failed
make: *** [all] Error 2
ERROR: Job failed: exit code 1
failed
t_ubuntu:18.04 Test
Makefile:289: recipe for target 'fr.gmo' failed
MSGFMT it.gmo
make[2]: Leaving directory '/builds/ljanda/NetworkManager/build/po'
make[1]: *** [all-recursive] Error 1
Makefile:17954: recipe for target 'all-recursive' failed
make[1]: Leaving directory '/builds/ljanda/NetworkManager/build'
make: *** [all] Error 2
Makefile:7694: recipe for target 'all' failed
ERROR: Job failed: exit code 1
failed
t_fedora:30 Test
../../po/fr.po:2255: 'msgid' and 'msgstr' entries do not both end with '\n'
/usr/bin/msgfmt: found 1 fatal error
make[2]: *** [Makefile:289: fr.gmo] Error 1
make[2]: *** Waiting for unfinished jobs....
make[2]: Leaving directory '/builds/ljanda/NetworkManager/build/po'
make[1]: *** [Makefile:18587: all-recursive] Error 1
make[1]: Leaving directory '/builds/ljanda/NetworkManager/build'
make: *** [Makefile:8362: all] Error 2
ERROR: Job failed: exit code 1
failed
t_fedora:29 Test
../../po/fr.po:2255: 'msgid' and 'msgstr' entries do not both end with '\n'
/usr/bin/msgfmt: found 1 fatal error
make[2]: *** [Makefile:289: fr.gmo] Error 1
make[2]: *** Waiting for unfinished jobs....
make[2]: Leaving directory '/builds/ljanda/NetworkManager/build/po'
make[1]: *** [Makefile:18587: all-recursive] Error 1
make[1]: Leaving directory '/builds/ljanda/NetworkManager/build'
make: *** [Makefile:8362: all] Error 2
ERROR: Job failed: exit code 1
failed
t_fedora:28 Test
/usr/bin/msgfmt: found 1 fatal error
MSGFMT hu.gmo
make[2]: *** [Makefile:289: fr.gmo] Error 1
make[2]: *** Waiting for unfinished jobs....
make[2]: Leaving directory '/builds/ljanda/NetworkManager/build/po'
make[1]: *** [Makefile:17954: all-recursive] Error 1
make[1]: Leaving directory '/builds/ljanda/NetworkManager/build'
make: *** [Makefile:7694: all] Error 2
ERROR: Job failed: exit code 1
failed
t_ubuntu:16.04 Test
make[2]: *** Waiting for unfinished jobs....
Makefile:289: recipe for target 'fr.gmo' failed
make[2]: Leaving directory '/builds/ljanda/NetworkManager/build/po'
make[1]: *** [all-recursive] Error 1
Makefile:17954: recipe for target 'all-recursive' failed
make[1]: Leaving directory '/builds/ljanda/NetworkManager/build'
make: *** [all] Error 2
Makefile:7694: recipe for target 'all' failed
ERROR: Job failed: exit code 1
failed
checkpatch Test
>>> VALIDATE "d2a8a3639 Revert "systemd: let "NetworkManager-wait-online.service" require "NetworkManager.service"""
(commit message):19: Refer to the commit id properly: <12 hex digits> ('<commit subject>'):
> Fixes: https://bugzilla.redhat.com/show_bug.cgi?id=1520865

The patch does not validate.
Uploading artifacts...
checkpatch-out.txt: found 1 matching files
Uploading artifacts to coordinator... ok
id=315839 responseStatus=201 Created token=4GxwWEYe
ERROR: Job failed: exit code 1