{
    "annotations": {
        "list": [
            {
                "builtIn": 1,
                "datasource": {
                    "type": "grafana",
                    "uid": "-- Grafana --"
                },
                "enable": true,
                "hide": true,
                "iconColor": "rgba(0, 211, 255, 1)",
                "name": "Annotations & Alerts",
                "target": {
                    "limit": 100,
                    "matchAny": false,
                    "tags": [],
                    "type": "dashboard"
                },
                "type": "dashboard"
            }
        ]
    },
    "description": "",
    "editable": true,
    "fiscalYearStartMonth": 0,
    "graphTooltip": 0,
    "id": 17,
    "iteration": 1674192140730,
    "links": [
        {
            "asDropdown": false,
            "icon": "external link",
            "includeVars": true,
            "keepTime": true,
            "tags": [
                "mesa"
            ],
            "targetBlank": true,
            "title": "Related dashboards",
            "tooltip": "",
            "type": "dashboards",
            "url": ""
        }
    ],
    "liveNow": false,
    "panels": [
        {
            "datasource": {
                "type": "influxdb",
                "uid": "a8QGxBOnz"
            },
            "description": "",
            "fieldConfig": {
                "defaults": {
                    "color": {
                        "mode": "thresholds"
                    },
                    "custom": {
                        "align": "auto",
                        "displayMode": "auto",
                        "filterable": true
                    },
                    "links": [
                        {
                            "targetBlank": true,
                            "title": "Job link",
                            "url": "https://gitlab.freedesktop.org/mesa/mesa/-/jobs/${__data.fields.job_id}"
                        },
                        {
                            "targetBlank": true,
                            "title": "Pipeline Link",
                            "url": "https://gitlab.freedesktop.org/mesa/mesa/-/pipelines/${__data.fields.pipeline_id}"
                        }
                    ],
                    "mappings": [],
                    "thresholds": {
                        "mode": "absolute",
                        "steps": [
                            {
                                "color": "green",
                                "value": null
                            },
                            {
                                "color": "red",
                                "value": 80
                            }
                        ]
                    }
                },
                "overrides": [
                    {
                        "matcher": {
                            "id": "byRegexp",
                            "options": "commit.*"
                        },
                        "properties": [
                            {
                                "id": "custom.hidden",
                                "value": false
                            },
                            {
                                "id": "unit",
                                "value": "string"
                            }
                        ]
                    }
                ]
            },
            "gridPos": {
                "h": 9,
                "w": 12,
                "x": 0,
                "y": 0
            },
            "id": 2,
            "options": {
                "footer": {
                    "fields": "",
                    "reducer": [
                        "sum"
                    ],
                    "show": false
                },
                "frameIndex": 3,
                "showHeader": true,
                "sortBy": [
                    {
                        "desc": false,
                        "displayName": "_time"
                    }
                ]
            },
            "pluginVersion": "8.3.1",
            "targets": [
                {
                    "datasource": {
                        "type": "influxdb",
                        "uid": "a8QGxBOnz"
                    },
                    "query": "import \"influxdata/influxdb/schema\"\nimport \"experimental\"\n\njob = \"${job}\"\ntrace = \"${trace}\"\nma_value = ${ma_value}\nstart_time = experimental.subDuration(d: 10d, from: v.timeRangeStart)\n\nexact_mean = (tables=<-, column) => tables\n    |> median(method: \"exact_selector\", column: column)\n\nns_to_fps = (tables=<-) => tables\n    |> map(\n        fn: (r) => ({r with\n            frame_time: 1000000000.0 / float(v: r.frame_time),\n        }),\n    )\n\nbaseline = from(bucket: \"mesa-perf-v2\")\n    |> range(start: start_time, stop: v.timeRangeStop)\n    |> filter(fn: (r) => r._measurement == \"frame_time\" and r.job_name == job and r.trace_name == trace)\n    |> schema.fieldsAsCols()\n    |> ns_to_fps()\n    |> rename(columns: {frame_time: \"_value\"})\n\nreal = baseline\n    |> aggregateWindow(every: v.windowPeriod, fn: exact_mean, createEmpty: false)\n    |> drop(columns: [\"_start\", \"_stop\"])\n    //|> group(columns:[\"_time\", \"_value\"], mode: \"except\")\n    |> rename(columns: {_value: \"median\"})\n    |> range(start: v.timeRangeStart, stop: v.timeRangeStop)\n\n    |> yield(name: \"median\")\n\nmini = baseline\n    |> aggregateWindow(every: v.windowPeriod, fn: min, createEmpty: false)\n    |> keep(columns: [\"_time\", \"_value\"])\n    |> movingAverage(n: ma_value)\n    |> range(start: v.timeRangeStart, stop: v.timeRangeStop)\n\n\n    |> rename(columns: {_value: \"min\"})\n    |> yield(name: \"min\")\n\n\nmaxi = baseline\n    |> aggregateWindow(every: v.windowPeriod, fn: max, createEmpty: false)\n    |> keep(columns: [\"_time\", \"_value\"])\n    |> movingAverage(n: ma_value)\n    |> range(start: v.timeRangeStart, stop: v.timeRangeStop)\n\n    |> rename(columns: {_value: \"max\"})\n    |> yield(name: \"max\")",
                    "refId": "A"
                }
            ],
            "title": "Data table for ${job} | ${trace}",
            "transformations": [
                {
                    "id": "merge",
                    "options": {}
                },
                {
                    "id": "organize",
                    "options": {
                        "excludeByName": {},
                        "indexByName": {
                            "_time": 0,
                            "commit_sha": 4,
                            "commit_title": 5,
                            "job_id": 7,
                            "max": 3,
                            "median": 2,
                            "min": 1,
                            "pipeline_id": 8,
                            "real": 6
                        },
                        "renameByName": {}
                    }
                }
            ],
            "type": "table"
        },
        {
            "datasource": {
                "type": "influxdb",
                "uid": "a8QGxBOnz"
            },
            "description": "",
            "fieldConfig": {
                "defaults": {
                    "color": {
                        "mode": "palette-classic"
                    },
                    "custom": {
                        "axisLabel": "",
                        "axisPlacement": "auto",
                        "barAlignment": 0,
                        "drawStyle": "line",
                        "fillOpacity": 0,
                        "gradientMode": "none",
                        "hideFrom": {
                            "legend": false,
                            "tooltip": false,
                            "viz": false
                        },
                        "lineInterpolation": "linear",
                        "lineWidth": 1,
                        "pointSize": 5,
                        "scaleDistribution": {
                            "type": "linear"
                        },
                        "showPoints": "auto",
                        "spanNulls": false,
                        "stacking": {
                            "group": "A",
                            "mode": "none"
                        },
                        "thresholdsStyle": {
                            "mode": "off"
                        }
                    },
                    "mappings": [],
                    "thresholds": {
                        "mode": "absolute",
                        "steps": [
                            {
                                "color": "green",
                                "value": null
                            },
                            {
                                "color": "red",
                                "value": 80
                            }
                        ]
                    },
                    "unit": "short"
                },
                "overrides": [
                    {
                        "matcher": {
                            "id": "byRegexp",
                            "options": "frame_time.*"
                        },
                        "properties": [
                            {
                                "id": "custom.lineStyle",
                                "value": {
                                    "dash": [
                                        0,
                                        20
                                    ],
                                    "fill": "dot"
                                }
                            },
                            {
                                "id": "custom.pointSize",
                                "value": 10
                            }
                        ]
                    }
                ]
            },
            "gridPos": {
                "h": 8,
                "w": 12,
                "x": 12,
                "y": 0
            },
            "id": 4,
            "options": {
                "legend": {
                    "calcs": [],
                    "displayMode": "list",
                    "placement": "bottom",
                    "showLegend": true
                },
                "tooltip": {
                    "mode": "single",
                    "sort": "none"
                }
            },
            "targets": [
                {
                    "datasource": {
                        "type": "influxdb",
                        "uid": "a8QGxBOnz"
                    },
                    "query": "import \"influxdata/influxdb/schema\"\nimport \"experimental\"\n\njob = \"${job}\"\ntrace = \"${trace}\"\nma_value = ${ma_value}\nstart_time = experimental.subDuration(d: 10d, from: v.timeRangeStart)\n\nexact_mean = (tables=<-, column) => tables\n    |> median(method: \"exact_selector\", column: column)\n\nns_to_fps = (tables=<-) => tables\n    |> map(\n        fn: (r) => ({r with\n            frame_time: 1000000000.0 / float(v: r.frame_time),\n        }),\n    )\n\nbaseline = from(bucket: \"mesa-perf-v2\")\n    |> range(start: start_time, stop: v.timeRangeStop)\n    |> filter(fn: (r) => r._measurement == \"frame_time\" and r.job_name == job and r.trace_name == trace)\n    |> schema.fieldsAsCols()\n    |> ns_to_fps()\n    |> rename(columns: {frame_time: \"_value\"})\n\nmedi = baseline\n    |> aggregateWindow(every: v.windowPeriod, fn: exact_mean, createEmpty: false)\n    |> movingAverage(n: ma_value)\n    |> keep(columns: [\"_time\", \"_value\"])\n    |> rename(columns: {_value: \"median\"})\n    |> yield(name: \"median\")\n\nreal = baseline\n    |> aggregateWindow(every: v.windowPeriod, fn: exact_mean, createEmpty: false)\n    |> drop(columns: [\"_start\", \"_stop\"])\n    //|> group(columns:[\"_time\", \"_value\"], mode: \"except\")\n    |> drop(columns: [\"job_id\", \"pipeline_id\"])\n    \n    |> rename(columns: {_value: \"real\"})\n    |> yield(name: \"real\")\n\nmini = baseline\n    |> aggregateWindow(every: v.windowPeriod, fn: min, createEmpty: false)\n    |> keep(columns: [\"_time\", \"_value\"])\n    |> movingAverage(n: ma_value)\n\n    |> rename(columns: {_value: \"min\"})\n    |> yield(name: \"min\")\n\n\nmaxi = baseline\n    |> aggregateWindow(every: v.windowPeriod, fn: max, createEmpty: false)\n    |> keep(columns: [\"_time\", \"_value\"])\n    |> movingAverage(n: ma_value)\n    |> rename(columns: {_value: \"max\"})\n    |> yield(name: \"max\")\n",
                    "refId": "A"
                }
            ],
            "title": "Simple graph for ${job} | ${trace}",
            "transformations": [],
            "type": "timeseries"
        }
    ],
    "refresh": "",
    "schemaVersion": 33,
    "style": "dark",
    "tags": [
        "mesa"
    ],
    "templating": {
        "list": [
            {
                "current": {
                    "selected": true,
                    "text": "15",
                    "value": "15"
                },
                "hide": 0,
                "label": "Moving Average length",
                "name": "ma_value",
                "options": [
                    {
                        "selected": true,
                        "text": "15",
                        "value": "15"
                    }
                ],
                "query": "15",
                "skipUrlSync": false,
                "type": "textbox"
            },
            {
                "current": {
                    "selected": false,
                    "text": "iris-apl-traces-performance",
                    "value": "iris-apl-traces-performance"
                },
                "datasource": {
                    "type": "influxdb",
                    "uid": "a8QGxBOnz"
                },
                "definition": "import \"influxdata/influxdb/schema\" import \"strings\" schema.tagValues( bucket: \"mesa-perf-v2\", tag: \"job_name\", )",
                "hide": 0,
                "includeAll": false,
                "multi": false,
                "name": "job",
                "options": [],
                "query": "import \"influxdata/influxdb/schema\" import \"strings\" schema.tagValues( bucket: \"mesa-perf-v2\", tag: \"job_name\", )",
                "refresh": 1,
                "regex": "",
                "skipUrlSync": false,
                "sort": 0,
                "type": "query"
            },
            {
                "current": {
                    "selected": false,
                    "text": "0ad/0ad-v2.trace",
                    "value": "0ad/0ad-v2.trace"
                },
                "datasource": {
                    "type": "influxdb",
                    "uid": "a8QGxBOnz"
                },
                "definition": "from(bucket: \"mesa-perf-v2\")\n|> range(start: v.timeRangeStart, stop: v.timeRangeStop)\n  |> filter(fn: (r) => r.job_name == \"${job}\")\n  |> group(columns: [\"trace_name\"], mode:\"by\")\n  |> count(column: \"_value\")\n  |> map(fn: (r) => ({ r : r.trace_name }))",
                "hide": 0,
                "includeAll": false,
                "multi": false,
                "name": "trace",
                "options": [],
                "query": "from(bucket: \"mesa-perf-v2\")\n|> range(start: v.timeRangeStart, stop: v.timeRangeStop)\n  |> filter(fn: (r) => r.job_name == \"${job}\")\n  |> group(columns: [\"trace_name\"], mode:\"by\")\n  |> count(column: \"_value\")\n  |> map(fn: (r) => ({ r : r.trace_name }))",
                "refresh": 2,
                "regex": "",
                "skipUrlSync": false,
                "sort": 0,
                "type": "query"
            }
        ]
    },
    "time": {
        "from": "now-30d",
        "to": "now"
    },
    "timepicker": {},
    "timezone": "",
    "title": "Detailed view for Mesa Driver performance",
    "uid": "oVwmipv4z",
    "version": 14,
    "weekStart": ""
}
