Update versions to 0.6.0

5 jobs for master in 11 minutes and 26 seconds (queued for 1 second)
Status Job ID Name Coverage
  Lint
passed #404460
rustfmt

00:00:15

 
  Test
failed #404461
test 1.34

00:11:10

failed #404463
allowed to fail
test nightly

00:07:17

failed #404462
test stable

00:11:10

 
  Extras
skipped #404464
allowed to fail
clippy
 
Name Stage Failure
failed
test stable Test


failures:
test_encode

test result: FAILED. 0 passed; 1 failed; 0 ignored; 0 measured; 0 filtered out

error: test failed, to rerun pass '-p gst-plugin-closedcaption --test mcc_enc'
ERROR: Job failed: exit code 1
failed
test 1.34 Test


failures:
test_encode

test result: FAILED. 0 passed; 1 failed; 0 ignored; 0 measured; 0 filtered out

error: test failed, to rerun pass '-p gst-plugin-closedcaption --test mcc_enc'
ERROR: Job failed: exit code 1
failed
test nightly Test


failures:
test_encode

test result: FAILED. 0 passed; 1 failed; 0 ignored; 0 measured; 0 filtered out

error: test failed, to rerun pass '-p gst-plugin-closedcaption --test mcc_enc'
ERROR: Job failed: exit code 1