add charset prober for Johab Korean

4 jobs for johab in 1 minute and 11 seconds (queued for 1 second)
latest
Status Job ID Name Coverage
  Build
failed debian/testing-clang #7975673

00:00:37

failed debian/testing-gcc #7975672

00:00:33

failed win32 #7975675

00:01:02

failed win64 #7975674

00:01:10

 
Name Stage Failure
failed
debian/testing-clang Build
make[2]: *** [src/tools/CMakeFiles/uchardet.dir/build.make:104: src/tools/uchardet] Error 1
make[1]: *** [CMakeFiles/Makefile2:231: src/tools/CMakeFiles/uchardet.dir/all] Error 2
make: *** [Makefile:160: all] Error 2
Uploading artifacts for failed job
Uploading artifacts...
_build: found 306 matching files and directories

Uploading artifacts as "archive" to coordinator... ok
id=7975673 responseStatus=201 Created token=1sQzLzCT
Cleaning up file based variables
ERROR: Job failed: exit code 1
failed
win64 Build
that you were standing at the crossroads.
I believe you were sinking down.


Uploading artifacts for failed job
Uploading artifacts...
_build: found 303 matching files and directories

Uploading artifacts as "archive" to coordinator... ok
id=7975674 responseStatus=201 Created token=gCysxKQX
Cleaning up file based variables
ERROR: Job failed: exit code 1
failed
win32 Build
that you were standing at the crossroads.
I believe you were sinking down.


Uploading artifacts for failed job
Uploading artifacts...
_build: found 303 matching files and directories

Uploading artifacts as "archive" to coordinator... ok
id=7975675 responseStatus=201 Created token=7YFRQfUT
Cleaning up file based variables
ERROR: Job failed: exit code 1
failed
debian/testing-gcc Build
make[2]: *** [src/tools/CMakeFiles/uchardet.dir/build.make:104: src/tools/uchardet] Error 1
make[1]: *** [CMakeFiles/Makefile2:231: src/tools/CMakeFiles/uchardet.dir/all] Error 2
make: *** [Makefile:160: all] Error 2
Uploading artifacts for failed job
Uploading artifacts...
_build: found 307 matching files and directories

Uploading artifacts as "archive" to coordinator... ok
id=7975672 responseStatus=201 Created token=ynNUi8F-
Cleaning up file based variables
ERROR: Job failed: exit code 1