build: don't link dispatcher with generated nmdbus-dispatche bindings

We don't need it anymore.

Still, for tests let gdbus-codegen run and generate the sources and
compile them. We want to keep "dispatcher/nm-dispatcher.xml" and ensure
that it is still valid.
11 jobs for th/dispatcher-cleanup in 7 minutes and 21 seconds (queued for 2 seconds)
Status Job ID Name Coverage
  Test
passed #313807
allowed to fail
checkpatch

00:00:59

failed #313814
t_debian:9

00:04:23

failed #313816
t_debian:sid

00:04:23

manual #313815
allowed to fail manual
t_debian:testing
failed #313808
t_fedora:28

00:07:20

failed #313809
t_fedora:29

00:04:17

failed #313810
t_fedora:30

00:04:44

manual #313811
allowed to fail manual
t_fedora:rawhide
failed #313812
t_ubuntu:16.04

00:04:19

failed #313813
t_ubuntu:18.04

00:04:31

 
  External
canceled NetworkManager test verification

04:57:37

 
Name Stage Failure
failed
t_fedora:28 Test
          ^~~~~~~~~~~~~~~~~~~~~
compilation terminated.
make[2]: *** [Makefile:14261: dispatcher/tests/dispatcher_tests_test_dispatcher_envp-test-dispatcher-envp.o] Error 1
make[2]: *** Waiting for unfinished jobs....
make[2]: Leaving directory '/builds/NetworkManager/NetworkManager/build'
make[1]: *** [Makefile:15881: all-recursive] Error 1
make[1]: Leaving directory '/builds/NetworkManager/NetworkManager/build'
make: *** [Makefile:6851: all] Error 2
ERROR: Job failed: exit code 1
failed
t_fedora:30 Test
      |          ^~~~~~~~~~~~~~~~~~~~~
compilation terminated.
make[2]: *** [Makefile:14830: dispatcher/tests/test_dispatcher_envp-test-dispatcher-envp.o] Error 1
make[2]: *** Waiting for unfinished jobs....
make[2]: Leaving directory '/builds/NetworkManager/NetworkManager/build'
make[1]: Leaving directory '/builds/NetworkManager/NetworkManager/build'
make[1]: *** [Makefile:16450: all-recursive] Error 1
make: *** [Makefile:7440: all] Error 2
ERROR: Job failed: exit code 1
failed
t_ubuntu:18.04 Test
make[2]: *** [dispatcher/tests/dispatcher_tests_test_dispatcher_envp-test-dispatcher-envp.o] Error 1
make[2]: *** Waiting for unfinished jobs....
make[2]: Leaving directory '/builds/NetworkManager/NetworkManager/build'
make[1]: *** [all-recursive] Error 1
Makefile:15881: recipe for target 'all-recursive' failed
make[1]: Leaving directory '/builds/NetworkManager/NetworkManager/build'
make: *** [all] Error 2
Makefile:6851: recipe for target 'all' failed
ERROR: Job failed: exit code 1
failed
t_debian:sid Test
          ^~~~~~~~~~~~~~~~~~~~~
compilation terminated.
make[2]: *** [Makefile:14830: dispatcher/tests/test_dispatcher_envp-test-dispatcher-envp.o] Error 1
make[2]: *** Waiting for unfinished jobs....
make[2]: Leaving directory '/builds/NetworkManager/NetworkManager/build'
make[1]: *** [Makefile:16450: all-recursive] Error 1
make[1]: Leaving directory '/builds/NetworkManager/NetworkManager/build'
make: *** [Makefile:7440: all] Error 2
ERROR: Job failed: exit code 1
failed
t_debian:9 Test
make[2]: *** Waiting for unfinished jobs....
Makefile:14261: recipe for target 'dispatcher/tests/dispatcher_tests_test_dispatcher_envp-test-dispatcher-envp.o' failed
make[2]: Leaving directory '/builds/NetworkManager/NetworkManager/build'
Makefile:15881: recipe for target 'all-recursive' failed
make[1]: *** [all-recursive] Error 1
make[1]: Leaving directory '/builds/NetworkManager/NetworkManager/build'
Makefile:6851: recipe for target 'all' failed
make: *** [all] Error 2
ERROR: Job failed: exit code 1
failed
t_ubuntu:16.04 Test
make[2]: *** Waiting for unfinished jobs....
Makefile:14261: recipe for target 'dispatcher/tests/dispatcher_tests_test_dispatcher_envp-test-dispatcher-envp.o' failed
make[2]: Leaving directory '/builds/NetworkManager/NetworkManager/build'
make[1]: *** [all-recursive] Error 1
Makefile:15881: recipe for target 'all-recursive' failed
make[1]: Leaving directory '/builds/NetworkManager/NetworkManager/build'
Makefile:6851: recipe for target 'all' failed
make: *** [all] Error 2
ERROR: Job failed: exit code 1
failed
t_fedora:29 Test
          ^~~~~~~~~~~~~~~~~~~~~
compilation terminated.
make[2]: *** [Makefile:14830: dispatcher/tests/test_dispatcher_envp-test-dispatcher-envp.o] Error 1
make[2]: *** Waiting for unfinished jobs....
make[2]: Leaving directory '/builds/NetworkManager/NetworkManager/build'
make[1]: *** [Makefile:16450: all-recursive] Error 1
make[1]: Leaving directory '/builds/NetworkManager/NetworkManager/build'
make: *** [Makefile:7440: all] Error 2
ERROR: Job failed: exit code 1