wireless-security: ensure Mesh networks can't use anything but SAE

They must be either open or use SAE key management.
7 jobs for lr/wifi-mesh in 20 minutes and 57 seconds (queued for 8 minutes and 35 seconds)
Status Job ID Name Coverage
  Test
passed #99184
allowed to fail
checkpatch

00:01:21

failed #99185
f28_build_autotools

00:20:26

failed #99186
f28_build_meson

00:04:47

failed #99187
f28_rpm_autotools_dbg

00:07:23

failed #99188
f28_rpm_meson_dbg

00:05:46

failed #99189
f_latest_build_autotools

00:09:16

failed #99190
allowed to fail
f_rawhide_build_autotools

00:06:19

 
Name Stage Failure
failed
f28_build_autotools Test
(./src/platform/tests/test-link-linux:6049): NetworkManager-DEBUG: 10:47:17.380: <trace> [1549363637.3800] platform-linux: netlink: recvmsg: new message NLMSG_ERROR, flags 0, seq 1306
# NetworkManager-DEBUG: <trace> [1549363637.3801] platform-linux: delayed-action: complete wait-for-nl-response (seq 1306, timeout in 0.199835417, response-type 0, success)
(./src/platform/tests/test-link-linux:6049): NetworkManager-DEBUG: 10:47:17.380: <trace> [1549363637.3801] platform-linux: delayed-action: complete wait-for-nl-response (seq 1306, timeout in 0.199835417, response-type 0, success)
# NetworkManager-DEBUG: <trace> [1549363637.3801] platform-linux: delayed-action: schedule wait-for-nl-response (seq 1307, timeout in 0.199998514, response-type 0)
(./src/platform/tests/test-link-linux:6049): NetworkManager-DEBUG: 10:47:17.380: <trace> [1549363637.3801] platform-linux: delayed-action: schedule wait-for-nl-response (seq 1307, timeout in 0.199998514, response-type 0)
# NetworkManager-DEBUG: <trace> [1549363637.3802] platform-linux: delayed-action: handle wait-for-nl-response (any)
(./src/platform/tests/test-link-linux:6049): NetworkManager-DEBUG: 10:47:17.380: <trace> [1549363637.3802] platform-linux: delayed-action: handle wait-for-nl-response (any)
# NetworkManager-DEBUG: <trace> [1549363637.3802] platform-linux: netlink: recvmsg: new message RTM_NEWLINK, flags 0, seq 1307
(./src/platform/tests/test-link-linux:6049): NetworkManager-DEBUG: 10:47:17.380: <t
Job's log exceeded limit of 8388608 bytes.
failed
f_latest_build_autotools Test
# NetworkManager-DEBUG: <trace> [1549363467.0717] platform-linux: event-notification: RTM_NEWROUTE, flags multi, seq 577, in-dump: fe80::/64 via :: dev 51 metric 256 mss 0 rt-src rt-kernel
(./src/platform/tests/test-link-linux:5898): NetworkManager-DEBUG: 10:44:27.071: <trace> [1549363467.0717] platform-linux: event-notification: RTM_NEWROUTE, flags multi, seq 577, in-dump: fe80::/64 via :: dev 51 metric 256 mss 0 rt-src rt-kernel
# NetworkManager-DEBUG: <trace> [1549363467.0717] platform-linux: netlink: recvmsg: new message RTM_NEWROUTE, flags multi, seq 577
(./src/platform/tests/test-link-linux:5898): NetworkManager-DEBUG: 10:44:27.071: <trace> [1549363467.0717] platform-linux: netlink: recvmsg: new message RTM_NEWROUTE, flags multi, seq 577
# NetworkManager-DEBUG: <trace> [1549363467.0717] platform-linux: event-notification: RTM_NEWROUTE, flags multi, seq 577: ignore
(./src/platform/tests/test-link-linux:5898): NetworkManager-DEBUG: 10:44:27.071: <trace> [1549363467.0717] platform-linux: event-notification: RTM_NEWROUTE, flags multi, seq 577: ignore
# NetworkManager-DEBUG: <trace> [1549363467.0718] platform-linux: netlink: recvmsg: new message RTM_NEWROUTE, flags multi, seq 577
(./src/platform/tests/test-link-linux:5898): NetworkManager-DEBUG: 10:44:27.071: <trace> [1549363467.0718] platform-linux: netlink: recvmsg: new message RTM_NEWROUTE, flags multi, seq 577
# NetworkManager-DEBUG:
Job's log exceeded limit of 4194304 bytes.
failed
f_rawhide_build_autotools Test
  CC       src/devices/bluetooth/libnm_device_plugin_bluetooth_la-nm-bluez-device.lo
cc1: all warnings being treated as errors
make[2]: *** [Makefile:14560: src/devices/wwan/libnm_wwan_la-nm-modem-broadband.lo] Error 1
make[2]: *** Waiting for unfinished jobs....
make[2]: Leaving directory '/builds/NetworkManager/NetworkManager/build'
make[1]: *** [Makefile:18308: all-recursive] Error 1
make[1]: Leaving directory '/builds/NetworkManager/NetworkManager/build'
make: *** [Makefile:8167: all] Error 2
ERROR: Job failed: exit code 1
failed
f28_rpm_meson_dbg Test
error: Bad exit status from /var/tmp/rpm-tmp.VkGvsY (%check)


RPM build errors:
Macro expanded in comment on line 117: %{real_version_major}/%{name}-%{real_version}.tar.xz

Bad exit status from /var/tmp/rpm-tmp.VkGvsY (%check)
ERROR: rpmbuild FAILED
ERROR: Job failed: exit code 1
failed
f28_rpm_autotools_dbg Test
error: Bad exit status from /var/tmp/rpm-tmp.0qVCPi (%check)


RPM build errors:
Macro expanded in comment on line 117: %{real_version_major}/%{name}-%{real_version}.tar.xz

Bad exit status from /var/tmp/rpm-tmp.0qVCPi (%check)
ERROR: rpmbuild FAILED
ERROR: Job failed: exit code 1
failed
f28_build_meson Test
(/builds/NetworkManager/NetworkManager/build/src/supplicant/tests/test-supplicant-config:3945): GLib-CRITICAL **: 10:35:13.063: Did not see expected message NetworkManager-INFO: *<info>  [*] Config: added 'ieee80211w' value '0'
/builds/NetworkManager/NetworkManager/tools/run-nm-test.sh: line 235: 3945 Trace/breakpoint trap (core dumped) "${NMTST_DBUS_RUN_SESSION[@]}" "$TEST" "$@"
-------

Full log written to /builds/NetworkManager/NetworkManager/build/meson-logs/testlog.txt
FAILED: meson-test
/usr/bin/python3 -u /usr/bin/meson test --no-rebuild --print-errorlogs
ninja: build stopped: subcommand failed.
ERROR: Job failed: exit code 1