gitlab-ci: add test with Fedora:latest image

12 jobs for master in 15 minutes and 6 seconds (queued for 1 second)
Status Job ID Name Coverage
  Test
passed #90793
allowed to fail
checkpatch

00:05:32

passed #90794
f28_build_autotools

00:14:40

passed #90795
f28_build_meson

00:05:10

passed #90796
f28_rpm_autotools_dbg

00:08:09

passed #90797
f28_rpm_meson_dbg

00:07:18

passed #90798
f_latest_build_autotools

00:07:48

failed #90799
allowed to fail
f_rawhide_build_autotools

00:14:46

 
  Deploy
passed #90800
pages

00:00:17

failed pages:deploy

00:00:00

failed pages:deploy

00:00:00

failed pages:deploy

00:00:00

failed pages:deploy

00:00:00

 
Name Stage Failure
failed
f_rawhide_build_autotools Test
  CC       src/devices/wifi/libnm_device_plugin_wifi_la-nm-device-olpc-mesh.lo
cc1: all warnings being treated as errors
make[2]: *** [Makefile:15397: src/ppp/libnm_ppp_plugin_la-nm-ppp-manager.lo] Error 1
make[2]: *** Waiting for unfinished jobs....
make[2]: Leaving directory '/builds/NetworkManager/NetworkManager/build'
make[1]: *** [Makefile:18193: all-recursive] Error 1
make[1]: Leaving directory '/builds/NetworkManager/NetworkManager/build'
make: *** [Makefile:8127: all] Error 2
ERROR: Job failed: exit code 1